Telephone Answering Services
type: Class
subclass of: Ycm1iSsTqyVBX-ItunQbg
definition: This U.S. industry comprises establishments primarily engaged in answering telephone calls and relaying messages on behalf of clients or for other establishments of the same enterprise.