Paperboard Mills
type: Class
subclass of: O1sHf7wRR2atFFie2DhDSQ
definition: This industry comprises establishments primarily engaged in manufacturing paperboard (e.g., can/drum stock, container board, corrugating medium, folding carton stock, linerboard, tube) from pulp. These establishments may manufacture or purchase pulp. In addition, the establishments may also convert the paperboard they make.