All Other Food Manufacturing
type: Class
subclass of: bVu-tszYQS2MtoFucM1fZA
definition: This industry comprises establishments primarily engaged in manufacturing food (except animal food; grain and oilseed milling; sugar and confectionery products; preserved fruits, vegetables, and specialty foods; dairy products; meat products; seafood products; baked goods and tortillas; snack foods; coffee and tea; flavoring syrups and concentrates; seasonings; and dressings). Included in this industry are establishments primarily engaged in mixing purchased dried and/or dehydrated ingredients, including those mixing purchased dried and/or dehydrated ingredients for soup mixes and bouillon.
example: Baking powder manufacturing
example: Cut or peeled fresh vegetables manufacturing
example: Dessert puddings manufacturing
example: Egg substitutes manufacturing
example: Fresh pasta manufacturing
example: Fresh pizza manufacturing
example: Honey processing
example: Popcorn (except popped) manufacturing
example: Powdered drink mixes (except chocolate, coffee, tea, or milk based) manufacturing
example: Sweetening syrups (except pure maple) manufacturing