Commercial Printing (except Screen and Books)
type: Class
subclass of: ncrsM5qARGa3n9b4i4EFXg
definition: This U.S. industry comprises establishments primarily engaged in commercial printing (except screen printing, books printing) without publishing (except fabric grey goods printing). The printing processes used in this industry include, but are not limited to, lithographic, gravure, flexographic, letterpress, engraving, and various digital printing technologies. This industry includes establishments engaged in commercial printing on purchased stock materials, such as stationery, invitations, labels, and similar items, on a job-order basis. Establishments primarily engaged in traditional printing activities combined with document photocopying services (i.e., quick printers) or primarily engaged in printing graphical materials using digital printing equipment are included in this industry.