Spring Manufacturing
type: Class
subclass of: UsuwArHqTi6W7A5ulsZQnw
definition: This U.S. industry comprises establishments primarily engaged in manufacturing springs from purchased wire, strip, or rod.