Solid Waste Combustors and Incinerators
type: Class
subclass of: nEU9oAnvS4GKVFPRE4aqrA
definition: This U.S. industry comprises establishments primarily engaged in operating combustors and incinerators for the disposal of nonhazardous solid waste. These establishments may produce byproducts, such as electricity and steam.