Printing and Writing Paper Merchant Wholesalers
type: Class
subclass of: 9h4zLPGEQpSwq15dSSk3tA
definition: This industry comprises establishments primarily engaged in the merchant wholesale distribution of bulk printing and/or writing paper generally on rolls for further processing.
example: Bulk envelope paper merchant wholesalers
example: Bulk groundwood paper merchant wholesalers
example: Bulk paper (e.g., fine, printing, writing) merchant wholesalers
example: Newsprint merchant wholesalers