Asphalt Paving Mixture and Block Manufacturing
type: Class
subclass of: r78yIFiZQrCFnspcr2BSqA
definition: This U.S. industry comprises establishments primarily engaged in manufacturing asphalt and tar paving mixtures and blocks from purchased asphaltic materials.