Other Individual and Family Services
type: Class
subclass of: 35AW6gVHR-CrcnYarn2ZaA
definition: This industry comprises establishments primarily engaged in providing nonresidential individual and family social assistance services (except those specifically directed toward children, the elderly, or persons with intellectual and/or developmental disabilities).
example: Community action services agencies
example: Crisis intervention centers
example: Family social services agencies
example: Family welfare services
example: Hotline centers
example: Marriage counseling services (except by offices of mental health practitioners)
example: Multi-purpose social services centers
example: Self-help organizations (except for disabled persons, the elderly)
example: Suicide crisis centers
example: Telephone counseling services