All Other Miscellaneous Fabricated Metal Product Manufacturing
type: Class
subclass of: diWuW6jcRmyt0AiiCTgOlQ
definition: This U.S. industry comprises establishments primarily engaged in manufacturing fabricated metal products (except forgings and stampings, cutlery and handtools, architectural and structural metals, boilers, tanks, shipping containers, hardware, spring and wire products, machine shop products, turned products, screws, nuts and bolts, metal valves, ball and roller bearings, ammunition, small arms and other ordnances and accessories, and fabricated pipes and pipe fittings).
example: Foil containers (except bags) manufacturing
example: Industrial pattern manufacturing
example: Metal hair curlers manufacturing
example: Metal ironing boards manufacturing
example: Metal pallets manufacturing
example: Metal pipe hangers and supports manufacturing
example: Metal safes manufacturing
example: Metal vaults (except burial) manufacturing
example: Permanent metallic magnets manufacturing
example: Portable metal ladders manufacturing
example: Sanitary ware (e.g., bathtubs, lavatories, sinks), metal and enameled metal, manufacturing
example: Steel wool manufacturing