Radio and Television Broadcasting Stations
type: Class
subclass of: R9YFJkZPmIaTVmf1YJ89hSq
definition: This industry group comprises establishments operating radio or television broadcasting stations for the programming and transmission of programs to the public. Programming may originate in their own studio, from an affiliated network, or from external sources.