All Other General Purpose Machinery Manufacturing
type: Class
subclass of: S0aqiIi5Q4WHMwEpiXDtkA
definition: This industry comprises establishments primarily engaged in manufacturing general purpose machinery (except ventilation, heating, air-conditioning, and commercial refrigeration equipment; metalworking machinery; engines, turbines, and power transmission equipment; pumps and compressors; and material handling equipment).
example: Automatic fire sprinkler systems manufacturing
example: Bridge and gate lifting machinery manufacturing
example: Fluid power cylinders manufacturing
example: Fluid power pumps manufacturing
example: Hydraulic and pneumatic jacks manufacturing
example: Industrial-type furnaces manufacturing
example: Packaging machinery manufacturing
example: Power-driven handtools manufacturing
example: Scales and balances manufacturing
example: Welding equipment manufacturing