Asphalt Shingle and Coating Materials Manufacturing
type: Class
subclass of: r78yIFiZQrCFnspcr2BSqA
definition: This U.S. industry comprises establishments primarily engaged in (1) saturating purchased mats and felts with asphalt or tar from purchased asphaltic materials and (2) manufacturing asphalt and tar and roofing cements and coatings from purchased asphaltic materials.