Farm Management Services
type: Class
subclass of: a-WMSGfvSDCXHFqyHRYryg
definition: This U.S. industry comprises establishments primarily engaged in providing farm management services on a contract or fee basis usually to citrus groves, orchards, or vineyards. These establishments always provide management and may arrange or contract for the partial or the complete operations of the farm establishment(s) they manage. Operational activities may include cultivating, harvesting, and/or other specialized agricultural support activities.